{"text_format":"1","workbook":"xlsx","n_sheets":9,"sheets":["Home","Data","Devices","Transfer","Ducts Rect","Ducts Round","Tab 2","Langage","Versions"],"not_rendered":{"charts":0,"images":4,"macros":1,"external_links":0,"defined_names":6,"comments":3,"pivot_tables":0},"unopened":[],"bounds":{"document_bytes":16777216,"sheet_cells":100000,"rows_first":2000,"rows_last":500,"rows_between":2000,"halvings":0,"cell_chars":16384,"cell_head_chars":4096},"cells_cut":0,"cells_raw":0,"read":"whole","date_system":"1900"}

{"sheet":"Home","index":0,"n_rows":31,"n_cols":5,"rows_kept":31,"cut":false,"hidden":false,"merged":[[4,1,4,7],[25,1,25,7],[9,1,9,7],[27,1,27,7],[28,1,28,7],[11,1,11,7],[12,1,12,7],[13,1,13,7]]}
[]
[]
[]
[]
[null,"Ontwerp van stookafdelingen"]
[null,null,null,null,"NBN B 61-001/002:2019"]
[]
[null,null,null,null,"Ontwikkeld in het kader van het Belgische project \"KMO - normenantenne\""]
[]
[null,"Bezoek onze website : http://www.wtcb.be"]
[]
[null,"Het WTCB kan niet verantwoordelijk gesteld worden voor de ingevoerde  "]
[null,"gegevens, noch voor het verkeerde gebruik van de software"]
[null,"of de verkeerde resultaten die eruit zouden voortkomen."]
[]
{"$rows_left_out":17}
{"sheet":"Data","index":1,"n_rows":32,"n_cols":7,"rows_kept":32,"cut":false,"hidden":false,"merged":[[30,2,30,7],[31,2,31,7],[6,1,6,7],[7,1,7,7],[13,2,13,4],[28,2,28,7],[29,2,29,7],[23,2,23,7],[3,1,3,7],[11,1,11,7],[19,1,19,7],[26,1,26,7],[14,2,14,7],[15,2,15,7],[16,2,16,7],[17,2,17,7],[21,2,21,7],[22,2,22,7],[24,2,24,7]]}
[]
[null,null,null,"Français",null,null,{"$f":"Langage!A33","v":"Nouveau calcul"}]
[]
[null,{"$f":"Langage!A28","v":"Données administratives"}]
[]
[]
[null,{"$f":"Langage!A31","v":"Conception des chaufferies"}]
[null,{"$f":"Langage!A32","v":"NBN B 61-001/002:2019"}]
[]
[]
[]
[null,{"$f":"Langage!A27","v":"Références"}]
[]
[null,{"$f":"Langage!A21","v":"Dossier"},null,null,null,null,{"$f":"Langage!A26","v":"Date"}]
[null,{"$f":"Langage!A22","v":"Nom"}]
{"$rows_left_out":18}
{"sheet":"Devices","index":2,"n_rows":46,"n_cols":24,"rows_kept":46,"cut":false,"hidden":false,"merged":[[26,5,27,5],[26,2,27,2],[24,1,24,10],[35,1,35,10],[27,8,27,9],[26,8,26,9],[3,1,3,5],[7,3,9,3],[7,5,9,5],[7,4,9,4],[7,6,9,6],[5,1,5,10],[7,9,9,9],[7,7,9,8],[7,10,9,10]]}
[]
[]
[]
[null,{"$f":"Langage!A5","v":"Données techniques"}]
[]
[null,{"$f":"Langage!A8","v":"Données relatives aux appareils de combustion"}]
[]
[null,null,{"$f":"Langage!A10","v":"Appareil"},{"$f":"Langage!A11","v":"Puissance nominale"},{"$f":"Langage!A9","v":"Circuit de combustion"},{"$f":"Langage!A48","v":"Combustible"},{"$f":"Langage!A49","v":"Brûleur"},{"$f":"Langage!A99","v":"Débit calorifique nominal\nsur Hs ou sur Hi\n(indiquer un des deux)"},null,{"$f":"Langage!A47","v":"Débit d’air comburant spécifique"},{"$f":"Langage!A46","v":"Débit d’air comburant"}]
[]
[null,null,null,null,null,null,null,null,null,null,null,null,null,null,null,null,null,null,null,null,"https://exceljet.net/formula/index-and-match-with-multiple-criteria"]
[null,null,null,"Pn   kW",null,null,null,"Qn,s   kW","Qn,i   kW","m³/(h.kW)","m³/h"]
[null,1,null,null,null,null,null,null,null,{"$f":"IF(E12=\"RS\",0,IF(OR(D12=\"\",S12=\"\"),\"\",IF(E12=\"NRS\",INDEX('Tab 2'!F$4:F$29,MATCH(1,(Devices!F12='Tab 2'!A$4:A$29)*(Devices!U12='Tab 2'!B$4:B$29)*(Devices!S12='Tab 2'!C$4:C$29),0)),\"\")))","v":""},{"$f":"IF(J12=\"\",\"\",J12*T12)","v":""},null,null,null,null,null,null,{"$f":"IF(F12=\"\",\"\",VLOOKUP(F12,'Tab 2'!A$4:F$29,2,FALSE))","v":""},{"$f":"IF(H12<>\"\",\"HS\",IF(I12<>\"\",\"HI\",\"\"))","v":""},{"$f":"IF(H12<>\"\",H12,IF(I12<>\"\",I12,0))","v":0},{"$f":"IF(OR(R12=0,R12=\"\"),\"\",G12)","v":""}]
[null,2,null,null,null,null,null,null,null,{"$f":"IF(E13=\"RS\",0,IF(OR(D13=\"\",S13=\"\"),\"\",IF(E13=\"NRS\",INDEX('Tab 2'!F$4:F$29,MATCH(1,(Devices!F13='Tab 2'!A$4:A$29)*(Devices!U13='Tab 2'!B$4:B$29)*(Devices!S13='Tab 2'!C$4:C$29),0)),\"\")))","v":""},{"$f":"IF(J13=\"\",\"\",J13*T13)","v":""},null,null,null,null,null,null,{"$f":"IF(F13=\"\",\"\",VLOOKUP(F13,'Tab 2'!A$4:F$29,2,FALSE))","v":""},{"$f":"IF(H13<>\"\",\"HS\",IF(I13<>\"\",\"HI\",\"\"))","v":""},{"$f":"IF(H13<>\"\",H13,IF(I13<>\"\",I13,0))","v":0},{"$f":"IF(OR(R13=0,R13=\"\"),\"\",G13)","v":""}]
[null,3,null,null,null,null,null,null,null,{"$f":"IF(E14=\"RS\",0,IF(OR(D14=\"\",S14=\"\"),\"\",IF(E14=\"NRS\",INDEX('Tab 2'!F$4:F$29,MATCH(1,(Devices!F14='Tab 2'!A$4:A$29)*(Devices!U14='Tab 2'!B$4:B$29)*(Devices!S14='Tab 2'!C$4:C$29),0)),\"\")))","v":""},{"$f":"IF(J14=\"\",\"\",J14*T14)","v":""},null,null,null,null,null,null,{"$f":"IF(F14=\"\",\"\",VLOOKUP(F14,'Tab 2'!A$4:F$29,2,FALSE))","v":""},"",0,""]
[null,4,null,null,null,null,null,null,null,{"$f":"IF(E15=\"RS\",0,IF(OR(D15=\"\",S15=\"\"),\"\",IF(E15=\"NRS\",INDEX('Tab 2'!F$4:F$29,MATCH(1,(Devices!F15='Tab 2'!A$4:A$29)*(Devices!U15='Tab 2'!B$4:B$29)*(Devices!S15='Tab 2'!C$4:C$29),0)),\"\")))","v":""},"",null,null,null,null,null,null,{"$f":"IF(F15=\"\",\"\",VLOOKUP(F15,'Tab 2'!A$4:F$29,2,FALSE))","v":""},"",0,""]
{"$rows_left_out":32}
{"sheet":"Transfer","index":3,"n_rows":49,"n_cols":72,"rows_kept":49,"cut":false,"hidden":false,"merged":[[3,1,3,5],[5,1,5,8],[11,2,12,2],[11,3,12,3],[11,4,12,4],[11,5,12,5],[11,6,12,6],[11,8,12,8],[11,7,12,7],[20,1,20,8],[26,2,27,2],[26,3,27,3],[26,4,27,4],[26,5,27,5],[26,6,27,6],[26,7,27,7],[26,8,27,8],[35,1,35,8],[41,2,42,2],[41,3,42,3],[41,4,42,4],[41,5,42,5],[41,6,42,6],[41,7,42,7],[41,8,42,8]]}
[]
[]
[]
[null,{"$f":"Langage!A86","v":"Dispositif de transfert d’air monté dans une paroi extérieure du local"}]
[]
[null,{"$f":"Langage!A36","v":"Air comburant"},null,null,null,null,null,null,null,null,null,null,null,null,null,null,null,null,null,null,null,null,null,null,null,null,"Critère d'acceptation","Pa",3]
[]
[null,null,{"$f":"Langage!A$43","v":"Débit"},null,null,null,null,null,null,null,null,null,"q/Dp","q/Dp",null,null,null,null,null,null,null,null,null,null,null,null,"Masse volumique air 20°C","kg/m³",1.204]
[null,null,"m³/h",null,null,null,null,null,null,null,null,null,"CE","CD",null,null,null,null,null,null,null,null,null,null,null,null,"Viscosité cinématique air 20°C","m²/s",{"$f":"0.000015","v":1.5E-5}]
[null,null,null,null,null,null,null,null,null,null,null,null,"Kin","Kout",null,null,null,null,null,null,null,null,null,null,null,null,"Rugosité absolue","m",{"$f":"0.00015","v":1.4999999999999999E-4},null,"Acier à joint lonitudinal"]
[]
[null,null,{"$f":"Langage!A$87","v":"Dispositif de transfert d’air"},{"$f":"Langage!A$82","v":"Données"},{"$f":"IF(D15=\"\",\"\",VLOOKUP(D15,M14:R16,2,FALSE))","v":""},{"$f":"IF(D15=\"\",\"\",VLOOKUP(D15,M14:R16,4,FALSE))","v":""},{"$f":"Langage!A$88","v":"Dimensions"},{"$f":"IF(D15=\"\",\"\",VLOOKUP(D15,M14:X16,8,FALSE))","v":""},{"$f":"IF(D15=\"\",\"\",VLOOKUP(D15,M14:X16,10,FALSE))","v":""}]
[]
[null,null,null,null,{"$f":"IF(D15=\"\",\"\",VLOOKUP(D15,M14:R16,3,FALSE))","v":""},{"$f":"IF(D15=\"\",\"\",VLOOKUP(D15,M14:R16,5,FALSE))","v":""},"mm",{"$f":"IF(D15=\"\",\"\",VLOOKUP(D15,M14:X16,9,FALSE))","v":""},{"$f":"IF(D15=\"\",\"\",VLOOKUP(D15,M14:X16,11,FALSE))","v":""},null,null,null,"Kin",{"$f":"Langage!A$77","v":"Facteur K (aspiration)"},"-",{"$f":"Langage!A$90","v":"Surface minimum"},"m²",{"$f":"IF(AND(D15=M14,E15<>\"\"),C10/3600/SQRT(2*AC$6/E15/AC$8),\"\")","v":""},{"$f":"IF(R14=\"\",\"\",IF(R14>1,\"OUT\",HLOOKUP(MIN(IF(AB15:BT15>R14,AB15:BT15)),AB15:BT16,2,TRUE)))","v":""}," "," ",{"$f":"Langage!A$89","v":"Surface"},"m²",{"$f":"IF(G15=\"\",\"\",HLOOKUP(G15,AB14:BT15,2,FALSE))","v":""},{"$f":"IF(X14>R14,\"OK\",\"NOK\")","v":"NOK"}," ",null,"200x100","250x100","200x150","300x100","250x150","200x200","400x100","300x150","250x200","300x200","400x150","250x250","300x250","500x150","400x200","300x300","600x150","400x250","500x200","400x300","600x200","500x250","500x300","600x250","400x400","800x200","600x300","500x400","800x250","600x400","800x300","1000x250","500x500","1000x300","600x500","800x400","600x600","1000x400","800x500","800x600","1000x500","1000x600","800x800","1000x800","1000x1000"]
[null,null,null,null,null,{"$f":"IF(D15=\"\",\"\",VLOOKUP(D15,M14:R16,6,FALSE))","v":""},null,null,{"$f":"IF(D15=\"\",\"\",VLOOKUP(D15,M14:X16,12,FALSE))","v":""},null,null,null,"q/Dp",{"$f":"Langage!A$83","v":"Différence de pression"},"Pa",{"$f":"Langage!A$91","v":"Débit minimum"},"m³/h",{"$f":"IF(D15=M15,C10*SQRT(E15/AC$6),\"\")","v":""}," ",{"$f":"Langage!A$92","v":"Débit nominal"},"m³/h",{"$f":"Langage!A$72","v":"Perte de pression"},"Pa",{"$f":"IF(OR(G15=\"\",H15=\"\"),\"\",(C10/H15)^2*E15)","v":""},{"$f":"IF(X15<=AC$6,\"OK\",\"NOK\")","v":"NOK"},{"$f":"Langage!A$93","v":"Max. 3.0 Pa"},null,{"$f":"(0.2*0.1)","v":2.0000000000000004E-2},{"$f":"(0.25*0.1)","v":2.5000000000000001E-2},{"$f":"(0.2*0.15)","v":0.03},{"$f":"(0.3*0.1)","v":0.03},{"$f":"(0.25*0.15)","v":3.7499999999999999E-2},{"$f":"(0.2*0.2)","v":4.0000000000000008E-2},{"$f":"(0.4*0.1)","v":4.0000000000000008E-2},{"$f":"(0.3*0.15)","v":4.4999999999999998E-2},{"$f":"(0.25*0.2)","v":0.05},{"$f":"(0.3*0.2)","v":0.06},{"$f":"(0.4*0.15)","v":0.06},{"$f":"(0.25*0.25)","v":6.25E-2},{"$f":"(0.3*0.25)","v":7.4999999999999997E-2},{"$f":"(0.5*0.15)","v":7.4999999999999997E-2},{"$f":"(0.4*0.2)","v":8.0000000000000016E-2},{"$f":"(0.3*0.3)","v":0.09},{"$f":"(0.6*0.15)","v":0.09},{"$f":"(0.4*0.25)","v":0.1},{"$f":"(0.5*0.2)","v":0.1},{"$f":"(0.4*0.3)","v":0.12},{"$f":"(0.6*0.2)","v":0.12},{"$f":"(0.5*0.25)","v":0.125},{"$f":"(0.5*0.3)","v":0.15},{"$f":"(0.6*0.25)","v":0.15},{"$f":"(0.4*0.4)","v":0.16000000000000003},{"$f":"(0.8*0.2)","v":0.16000000000000003},{"$f":"(0.6*0.3)","v":0.18},{"$f":"(0.5*0.4)","v":0.2},{"$f":"(0.8*0.25)","v":0.2},{"$f":"(0.6*0.4)","v":0.24},{"$f":"(0.8*0.3)","v":0.24},{"$f":"(1*0.25)","v":0.25},{"$f":"(0.5*0.5)","v":0.25},{"$f":"(1*0.3)","v":0.3},{"$f":"(0.6*0.5)","v":0.3},{"$f":"(0.8*0.4)","v":0.32000000000000006},{"$f":"(0.6*0.6)","v":0.36},{"$f":"(1*0.4)","v":0.4},{"$f":"(0.8*0.5)","v":0.4},{"$f":"(0.8*0.6)","v":0.48},{"$f":"(1*0.5)","v":0.5},{"$f":"(1*0.6)","v":0.6},{"$f":"(0.8*0.8)","v":0.64000000000000012},{"$f":"(1*0.8)","v":0.8},{"$f":"(1*1)","v":1}]
{"$rows_left_out":35}
{"sheet":"Ducts Rect","index":4,"n_rows":64,"n_cols":76,"rows_kept":64,"cut":false,"hidden":false,"merged":[[3,1,3,5],[5,1,5,9],[11,2,12,2],[11,3,12,3],[11,4,12,4],[11,5,12,5],[11,6,12,6],[20,1,20,9],[26,2,27,2],[26,3,27,3],[26,4,27,4],[26,5,27,5],[26,6,27,6],[35,1,35,9],[41,2,42,2],[41,3,42,3],[41,4,42,4],[41,5,42,5],[41,6,42,6]]}
[]
[]
[]
[null,{"$f":"Langage!A85","v":"Conduits de ventilation - Rectangulaires - Tôle d'acier galvanisé"}]
[]
[null,{"$f":"Langage!A36","v":"Air comburant"},null,null,null,null,null,null,null,null,null,null,null,null,null,null,null,null,null,null,null,"Critère d'acceptation","Pa",3]
[]
[null,null,{"$f":"Langage!A43","v":"Débit"},{"$f":"Langage!A69","v":"Longueur droite"},{"$f":"Langage!A70","v":"Coude 90°"},{"$f":"Langage!A71","v":"Coude 45°"},{"$f":"Langage!A88","v":"Dimensions"},{"$f":"Langage!A73","v":"Options"},{"$f":"Langage!A94","v":"Minimum"},{"$f":"Langage!A72","v":"Perte de pression"},null,null,"q/Dp","q/Dp",null,null,null,null,null,null,null,"Masse volumique air 20°C","kg/m³",1.204]
[null,null,"m³/h","m","#","#","mm",null,"mm","Pa",null,null,"CE","CD",null,null,null,null,null,null,null,"Viscosité cinématique air 20°C","m²/s",{"$f":"0.000015","v":1.5E-5}]
[null,null,null,null,null,null,null,null,{"$f":"IF(C10=\"\",\"\",HLOOKUP(\"OK\",X12:BP27,2,FALSE))","v":""},{"$f":"IF(C10=\"\",\"\",HLOOKUP(\"OK\",X12:BP27,16,FALSE))","v":""},null,null,"Kin","Kout",null,null,null,null,null,null,null,"Rugosité absolue","m",{"$f":"0.00015","v":1.4999999999999999E-4},null,null,null,null,null,"Acier à joint lonitudinal"]
[null,null,null,null,null,null,null,null,{"$f":"IF(C10=\"\",\"\",VLOOKUP(T12,BW$12:BX$56,2,FALSE))","v":""},{"$f":"IF(C10=\"\",\"\",HLOOKUP(I11,X13:BP27,15,FALSE))","v":""}]
[null,null,{"$f":"Langage!A75","v":"Bouche de prise d'air"},{"$f":"Langage!A82","v":"Données"},{"$f":"IF(D15=\"\",\"\",VLOOKUP(D15,N14:S16,2,FALSE))","v":""},{"$f":"IF(D15=\"\",\"\",VLOOKUP(D15,N14:S16,4,FALSE))","v":""},null,null,{"$f":"IF(C10=\"\",\"\",VLOOKUP(U12,BW$12:BX$56,2,FALSE))","v":""},{"$f":"IF(C10=\"\",\"\",HLOOKUP(I12,X13:BP27,15,FALSE))","v":""},null,null,null,null,null,null,null,null,{"$f":"IF(I10=\"\",\"\",HLOOKUP(I10,X13:BP14,2,FALSE))","v":""},{"$f":"IF(C10=\"\",\"\",MIN(IF(X14:BP14>S12,X14:BP14)))","v":""},{"$f":"IF(T12=0,0,IF(C10=\"\",\"\",MIN(IF(X14:BP14>T12,X14:BP14))))","v":""},"Air comburant",null,{"$f":"IF(OR(X27=\"OUT\",X27>$X$6),\"OUT\",\"OK\")","v":"OK"},{"$f":"IF(OR(Y27=\"OUT\",Y27>$X$6),\"OUT\",\"OK\")","v":"OK"},{"$f":"IF(OR(Z27=\"OUT\",Z27>$X$6),\"OUT\",\"OK\")","v":"OK"},"OK","OK","OK","OK","OK","OK","OK","OK","OK","OK","OK","OK","OK","OK","OK","OK","OK","OK","OK","OK","OK","OK","OK","OK","OK","OK","OK","OK","OK","OK","OK","OK","OK","OK","OK","OK","OK","OK","OK","OK","OK","OK",null,null,null,null,null,"200x100",0.13300000000000001,{"$f":"BV12","v":"200x100"}]
[null,null,null,null,null,null,null,null,null,null,null,null,null,null,null,null,null,null,"Perte de pression","Vitesse",null,"Dimensions possibles","mm","200x100","250x100","300x100","400x100","200x150","250x150","200x200","300x150","400x150","250x200","500x150","300x200","600x150","250x250","400x200","300x250","500x200","300x300","600x200","400x250","800x200","500x250","400x300","600x250","500x300","800x250","400x400","600x300","1000x250","800x300","500x400","1000x300","600x400","500x500","800x400","600x500","1000x400","600x600","800x500","1000x500","800x600","1000x600","800x800","1000x800","1000x1000",null,null,null,null,null,"250x100",0.14299999999999999,{"$f":"BV13","v":"250x100"}]
[null,null,null,null,{"$f":"IF(D15=\"\",\"\",VLOOKUP(D15,N14:S16,3,FALSE))","v":""},{"$f":"IF(D15=\"\",\"\",VLOOKUP(D15,N14:S16,5,FALSE))","v":""},null,null,{"$f":"Langage!A$96","v":"Conduit"},{"$f":"IF(OR(S19=0,S19=\"\"),\"\",IF(S19=\"OUT\",\"OUT\",S19))","v":""},null,null,null,"Kin",{"$f":"Langage!A$77","v":"Facteur K (aspiration)"},"-"," "," ",{"$f":"IF(D15<>N14,\"\",E15*X8*T14^2/2)","v":""},{"$f":"IF(G10=\"\",\"\",HLOOKUP(G10,X13:BP28,16,FALSE))","v":""},null,"Diamètre hydraulique","mm",0.13300000000000001,0.14299999999999999,0.15,0.16,0.17100000000000001,0.188,0.2,0.2,0.218,0.222,0.23100000000000001,0.24,0.24,0.25,0.26700000000000002,0.27300000000000002,0.28599999999999998,0.3,0.3,0.308,0.32,0.33300000000000002,0.34300000000000003,0.35299999999999998,0.375,0.38100000000000001,0.4,0.4,0.4,0.436,0.44400000000000001,0.46200000000000002,0.48,0.5,0.53300000000000003,0.54500000000000004,0.57099999999999995,0.6,0.61499999999999999,0.66700000000000004,0.68600000000000005,0.75,0.8,0.88900000000000001,1,null,null,null,null,null,"300x100",0.15,"300x100"]
[null,null,null,null,null,null,null,null,{"$f":"Langage!A$97","v":"Bouche"},{"$f":"IF(D15=\"\",\"\",VLOOKUP(D15,N14:S16,6,FALSE))","v":""},null,null,null,"q/Dp",{"$f":"Langage!A$83","v":"Différence de pression"},"Pa",{"$f":"Langage!$A$43","v":"Débit"},"m³/h",{"$f":"IF(D15<>N15,\"\",(C10/F15)^2*E15)","v":""},null,null,"Section","m²",null,null,null,null,null,null,null,null,null,null,null,null,null,null,null,null,null,null,null,null,null,null,null,null,null,null,null,null,null,null,null,null,null,null,null,null,null,null,null,null,null,null,null,null,null,null,null,null,null,null,"400x100",0.16,"400x100"]
{"$rows_left_out":50}
{"sheet":"Ducts Round","index":5,"n_rows":63,"n_cols":43,"rows_kept":63,"cut":false,"hidden":false,"merged":[[35,1,35,9],[41,2,42,2],[41,3,42,3],[41,4,42,4],[41,5,42,5],[41,6,42,6],[20,1,20,9],[26,2,27,2],[26,3,27,3],[26,4,27,4],[26,5,27,5],[26,6,27,6],[3,1,3,5],[5,1,5,9],[11,2,12,2],[11,3,12,3],[11,4,12,4],[11,5,12,5],[11,6,12,6]]}
[]
[]
[]
[null,{"$f":"Langage!A68","v":"Conduits de ventilation - Circulaires - Acier galvanisé à joint spiral"}]
[]
[null,{"$f":"Langage!A36","v":"Air comburant"},null,null,null,null,null,null,null,null,null,null,null,null,null,null,null,null,null,null,null,"Critère d'acceptation","Pa",3]
[]
[null,null,{"$f":"Langage!A43","v":"Débit"},{"$f":"Langage!A69","v":"Longueur droite"},{"$f":"Langage!A70","v":"Coude 90°"},{"$f":"Langage!A71","v":"Coude 45°"},{"$f":"Langage!A74","v":"Diamètre"},{"$f":"Langage!A73","v":"Options"},{"$f":"Langage!A94","v":"Minimum"},{"$f":"Langage!A72","v":"Perte de pression"},null,null,"q/Dp","q/Dp",null,null,null,null,null,null,null,"Masse volumique air 20°C","kg/m³",1.204]
[null,null,"m³/h","m","#","#","mm",null,"mm","Pa",null,null,"CE","CD",null,null,null,null,null,null,null,"Viscosité cinématique air 20°C","m²/s",{"$f":"0.000015","v":1.5E-5}]
[null,null,null,null,null,null,null,null,{"$f":"IF(C10=\"\",\"\",HLOOKUP(\"OK\",X12:AQ27,2,FALSE))","v":""},{"$f":"IF(C10=\"\",\"\",HLOOKUP(\"OK\",X12:AQ27,16,FALSE))","v":""},null,null,"Kin","Kout",null,null,null,null,null,null,null,"Rugosité absolue","m",{"$f":"0.00009","v":9.0000000000000006E-5},null,null,"Acier à joint spiral"]
[null,null,null,null,null,null,null,null,{"$f":"IF(C10=\"\",\"\",MIN(IF(X13:AQ13>I10,X13:AQ13)))","v":""},{"$f":"IF(C10=\"\",\"\",HLOOKUP(I11,X13:AQ27,15,FALSE))","v":""}]
[null,null,{"$f":"Langage!A75","v":"Bouche de prise d'air"},{"$f":"Langage!A82","v":"Données"},{"$f":"IF(D15=\"\",\"\",VLOOKUP(D15,N14:S16,2,FALSE))","v":""},{"$f":"IF(D15=\"\",\"\",VLOOKUP(D15,N14:S16,4,FALSE))","v":""},null,null,{"$f":"IF(I11=0,0,IF(C10=\"\",\"\",MIN(IF(X13:AQ13>I11,X13:AQ13))))","v":""},{"$f":"IF(C10=\"\",\"\",HLOOKUP(I12,X13:AQ27,15,FALSE))","v":""},null,null,null,null,null,null,null,null,null,null,null,"Air comburant",null,{"$f":"IF(OR(X27=\"OUT\",X27>$X$6),\"OUT\",\"OK\")","v":"OK"},{"$f":"IF(OR(Y27=\"OUT\",Y27>$X$6),\"OUT\",\"OK\")","v":"OK"},"OK","OK","OK","OK","OK","OK","OK","OK","OK","OK","OK","OK","OK","OK","OK","OK","OK","OK"]
[null,null,null,null,null,null,null,null,null,null,null,null,null,null,null,null,null,null,"Perte de pression","Vitesse",null,"Diamètres possibles","mm",100,125,150,160,200,250,300,315,355,400,450,500,560,630,710,800,900,1000,1120,1250]
[null,null,null,null,{"$f":"IF(D15=\"\",\"\",VLOOKUP(D15,N14:S16,3,FALSE))","v":""},{"$f":"IF(D15=\"\",\"\",VLOOKUP(D15,N14:S16,5,FALSE))","v":""},null,null,{"$f":"Langage!A$96","v":"Conduit"},{"$f":"IF(OR(S19=0,S19=\"\"),\"\",IF(S19=\"OUT\",\"OUT\",S19))","v":""},null,null,null,"Kin",{"$f":"Langage!A$77","v":"Facteur K (aspiration)"},"-"," "," ",{"$f":"IF(D15<>N14,\"\",E15*X8*T14^2/2)","v":""},{"$f":"IF(G10=\"\",\"\",HLOOKUP(G10,X13:AQ27,4,FALSE))","v":""},null,"Diamètre","mm",{"$f":"X13/1000","v":0.1},0.125,{"$f":"Z13/1000","v":0.15},0.16,0.2,0.25,0.3,0.315,0.35499999999999998,0.4,0.45,0.5,0.56000000000000005,0.63,0.71,0.8,0.9,1,1.1200000000000001,1.25]
[null,null,null,null,null,null,null,null,{"$f":"Langage!A$97","v":"Bouche"},{"$f":"IF(D15=\"\",\"\",VLOOKUP(D15,N14:S16,6,FALSE))","v":""},null,null,null,"q/Dp",{"$f":"Langage!A$83","v":"Différence de pression"},"Pa",{"$f":"Langage!$A$43","v":"Débit"},"m³/h",{"$f":"IF(D15<>N15,\"\",(C10/F15)^2*E15)","v":""},null,null,"Section","m²",{"$f":"PI()*(X14)^2/4","v":7.8539816339744835E-3},1.2271846303085129E-2,{"$f":"PI()*(Z14)^2/4","v":1.7671458676442587E-2},2.0106192982974676E-2,3.1415926535897934E-2,4.9087385212340517E-2,7.0685834705770348E-2,7.793113276311181E-2,9.8979803542163416E-2,0.12566370614359174,0.15904312808798329,0.19634954084936207,0.2463008640414398,0.31172453105244724,0.39591921416865367,0.50265482457436694,0.63617251235193317,0.78539816339744828,0.98520345616575922,1.227184630308513]
{"$rows_left_out":49}
{"sheet":"Tab 2","index":6,"n_rows":29,"n_cols":10,"rows_kept":29,"cut":false,"hidden":true,"merged":[]}
["NBN B 61-001/002 - Tableau 2"]
[]
["Code",null,null,"Combustible","Type d'appareil de combustion","Débit d'air comburant spécifique"]
["NG","BWI","HI","Gaz naturel de type H ou L","Brûleur avec coupe-tirage",2.9,null,null,"Natural gas","Burner with draught diverter"]
["NG","BWO","HI","Gaz naturel de type H ou L","Brûleur sans coupe-tirage",1.34,null,null,null,"Burner without draught diverter"]
["NG","ICE","HI","Gaz naturel de type H ou L","Moteur à combustion interne",1.34,null,null,null,"Internal combustion engine"]
["LPG","BWI","HI","Propane / Butane","Brûleur avec coupe-tirage",2.9,null,null,"Liquefied Petroleum Gas"]
["LPG","BWO","HI","Propane / Butane","Brûleur sans coupe-tirage",1.34]
["LPG","ICE","HI","Propane / Butane","Moteur à combustion interne",1.34]
["HO",null,"HI","Gasoil de chauffage","Brûleur ou moteur à\ncombustion interne",1.33,null,null,"Heating oil"]
["CO",null,"HI","Coke",null,1.71,null,null,"Coke"]
["KE",null,"HI","Pétrole lampant",null,1.41,null,null,"Kerosene"]
["SC",null,"HI","Charbon (anthracite)",null,1.67,null,null,"Stone coal (anthracite)"]
["BC",null,"HI","Lignite",null,1.72,null,null,"Brown coal"]
["WL",null,"HI","Bois (bûches)",null,2.9,null,null,"Wood (logs)"]
{"$rows_left_out":15}
{"sheet":"Langage","index":7,"n_rows":100,"n_cols":5,"rows_kept":100,"cut":false,"hidden":true,"merged":[]}
["Choix de la langue"]
[null,1,2,3,4]
[{"$f":"Data!D2","v":"Français"},"Français","Nederlands","English","Deutsch"]
[]
[{"$f":"IF(A$3=B$3,B5,IF(A$3=C$3,C5,IF(A$3=D$3,D5,E5)))","v":"Données techniques"},"Données techniques","Technische gegevens"]
["Total","Total","Totaal","Total","Gesamt"]
["Entité de bâtiment","Entité de bâtiment","Gebouwentiteit","Building entity","Baukörper"]
["Données relatives aux appareils de combustion","Données relatives aux appareils de combustion","Gegevens betreffende de verbrandingstoestellen"]
["Circuit de combustion","Circuit de combustion","Verbrandingskring"]
["Appareil","Appareil","Toestel","Device"]
["Puissance nominale","Puissance nominale","Nominaal vermogen"]
["Surface au sol","Surface au sol","Vloeroppervlakte"]
["Débit de l'amenée d'air","Débit de l'amenée d'air","luchttoevoerdebiet"]
["Débit de l'évacuation d'air","Débit de l'évacuation d'air","luchtafvoerdebiet"]
["Type","Type","Type"]
{"$rows_left_out":86}
{"sheet":"Versions","index":8,"n_rows":37,"n_cols":3,"rows_kept":37,"cut":false,"hidden":true,"merged":[]}
["Liste des versions successives"]
[]
["v1.0","2019-12-13","Original"]
["v1.1","2020-03-12","Correction d'une erreur de recherche dans le tableau des conduits rectangulaires (tableau de recherche pas complet)"]
[null,null,"Correction du calcul de la vitesse d'air dans les grilles des conduits rectangulaires (vitesse calculée avec la section hydraulique et pas la section réelle)"]
[null,null,"Modification de la fonction de recherche de la 3ème section possible"]
["v1.2","2020-03-26","Correction d'un lien erroné vers une autre feuille de calcul (pas d'influence sur les résultats)"]
[null,null,"Correction de la mise en forme conditionnelle de cellules"]
[null,null,"Correction de la dénomination des bouches pour le rejet d'air."]
["v2.1","2020-05-25","Modification de la forme d'introduction du débit calorifique"]
[null,null,"Elargissement du choix des conduits circulaires et rectangulaires  (toutes les dimensions normalisées pour les conduits circulaires + toutes les dimensions normalisées jusque 1000 mm pour les conduits rectangulaires)"]
[null,null,"Elargissement du choix aux coefficients CD et CE pour les grilles et les bouches"]
[null,null,"Rassemblement de tous les sigles dans l'onglet Devices"]
[null,null,"Suppression des générations d'erreur quand on introduit une valeur pas nécessaire dans les caractéristiques des générateurs de chaleur"]
["v2.2","2020-09-19","Correction du calcul de la vitesse d'air dans les conduits rectangulaires (vitesse calculée avec la section hydraulique et pas la section réelle)"]
{"$rows_left_out":22}