{"text_format":"1","workbook":"xlsx","n_sheets":9,"sheets":["Info","Calcul - Berekening","Choix vase - Keuze vat","Richtlijnen","Directives","Langage","DataBase","Coef_expansion","Images"],"not_rendered":{"charts":0,"images":45,"macros":1,"external_links":0,"defined_names":58,"comments":4,"pivot_tables":0},"unopened":[],"bounds":{"document_bytes":16777216,"sheet_cells":100000,"rows_first":2000,"rows_last":500,"rows_between":2000,"halvings":0,"cell_chars":16384,"cell_head_chars":4096},"cells_cut":0,"cells_raw":0,"read":"whole","date_system":"1900"}

{"sheet":"Info","index":0,"n_rows":32,"n_cols":10,"rows_kept":32,"cut":false,"hidden":false,"merged":[[31,9,31,15],[31,1,31,7],[5,1,5,7],[15,1,15,7],[16,1,16,7],[17,1,17,7],[18,1,18,7],[19,1,19,7],[20,1,20,7],[22,1,22,7],[19,9,19,15],[20,9,20,15],[21,9,21,15],[22,9,22,15],[30,9,30,15],[12,9,12,15],[15,9,15,15],[16,9,16,15],[17,9,17,15],[18,9,18,15],[4,9,4,15],[5,9,5,15],[7,9,7,15],[9,9,9,15],[11,9,11,15],[21,1,21,7],[4,1,4,7],[9,1,9,7],[11,1,11,7],[12,1,12,7],[13,1,13,7],[7,1,7,7]]}
[]
[]
[]
[]
[null,"Dimensionering van expansievaten",null,null,null,null,null,null,null,"Dimensionnement des vases d'expansion"]
[null,"voor sanitaire installaties",null,null,null,null,null,null,null,"destinés à des installations sanitaires"]
[]
[null,"Ontwikkeld in het kader van het Belgische project \"KMO - Normenantenne\"",null,null,null,null,null,null,null,"Développé dans le cadre du projet belge \"PME - Antenne-normes\""]
[]
[null,"Bezoek onze website : http://www.wtcb.be",null,null,null,null,null,null,null,"Visitez notre site web : http://www.cstc.be"]
[]
[null,"Het WTCB kan niet verantwoordelijk gesteld worden voor de ingevoerde  ",null,null,null,null,null,null,null,"Le CSTC ne peut être tenu responsable des données introduites, de la"]
[null,"gegevens, noch voor het verkeerde gebruik van de software",null,null,null,null,null,null,null,"mauvaise utilisation du programme ou des erreurs qui en résulteraient."]
[null,"of de verkeerde resultaten die eruit zouden voortkomen."]
[]
{"$rows_left_out":18}
{"sheet":"Calcul - Berekening","index":1,"n_rows":67,"n_cols":20,"rows_kept":67,"cut":false,"hidden":false,"merged":[[63,13,63,15],[52,12,52,13],[54,12,54,13],[58,12,58,13],[54,14,54,15],[58,14,58,15],[52,14,52,15],[62,13,62,15],[42,12,42,13],[44,12,44,13],[45,12,45,13],[46,12,46,13],[39,10,39,15],[47,12,47,13],[49,12,49,13],[50,12,50,13],[47,14,47,15],[49,14,49,15],[50,14,50,15],[58,1,58,3],[54,1,54,3],[53,1,53,3],[57,1,57,3],[53,4,53,7],[54,4,54,7],[57,4,57,7],[58,4,58,7],[56,1,56,6],[3,1,3,16],[5,1,5,16],[7,1,7,2],[7,3,7,10],[16,1,16,10],[8,1,8,2],[9,1,9,2],[10,1,10,2],[7,11,7,12],[7,13,7,15],[8,3,8,15],[9,3,9,15],[10,3,10,15],[18,1,18,10],[17,1,17,10],[19,1,19,10],[21,1,21,16],[11,3,11,15],[11,1,11,2],[13,1,13,16],[15,1,15,10],[30,1,30,3],[30,4,30,12],[27,1,27,3],[23,1,23,3],[24,1,24,3],[24,4,24,12],[23,4,23,12],[25,1,25,3],[28,1,28,3],[29,1,29,3],[50,1,50,3],[51,1,51,3],[52,1,52,3],[42,14,42,15],[44,14,44,15],[45,14,45,15],[46,14,46,15],[50,4,50,7],[44,4,44,7],[45,4,45,7],[46,4,46,7],[47,4,47,7],[51,4,51,7],[52,4,52,7],[46,1,46,3],[47,1,47,3],[32,1,32,16],[49,1,49,3],[44,1,44,3],[45,1,45,3],[48,1,48,3],[34,1,34,3],[35,1,35,3],[36,1,36,3],[37,1,37,3],[39,1,39,3],[40,1,40,3],[48,4,48,7],[49,4,49,7],[39,4,39,7],[40,4,40,7],[41,4,41,6]]}
[]
[null,"   Langue / Taal :",null,"Français"]
[]
[null,{"$f":"Langage!A5","v":"Feuille de calcul destinée au dimensionnement du volume d'un vase d'expansion sanitaire"}]
[]
[null,{"$f":"Langage!A6","v":"Références"}]
[]
[null,{"$f":"Langage!A64","v":"Dossier"},null,null,null,null,null,null,null,null,null,{"$f":"Langage!A69","v":"Date  "}]
[null,{"$f":"Langage!A65","v":"Nom"}]
[null,{"$f":"Langage!A66","v":"Adresse"}]
[null,{"$f":"Langage!A67","v":"Commune"}]
[null,{"$f":"Langage!A68","v":"Commentaire"}]
[]
[null,{"$f":"Langage!A7","v":"Données relatives à l'installation"}]
[]
{"$rows_left_out":53}
{"sheet":"Choix vase - Keuze vat","index":2,"n_rows":333,"n_cols":25,"rows_kept":333,"cut":false,"hidden":false,"merged":[[2,12,2,13],[3,20,3,21],[0,5,1,6],[0,10,1,20]]}
[1,1,{"$f":"Langage!A119","v":"Sélectionnez votre modèle via ce menu déroulant."},null,1,{"$f":"Langage!A117","v":"RETOUR A LA FEUILLE DE CALCUL "},null,null,null,null,{"$f":"Langage!A113","v":"Si le modèle souhaité ne figure pas dans notre base de données, veuillez sélectionner \"NOT IN DATABASE\"."},null,null,null,null,null,null,null,null,null,null,null,"VN,min","p0,max"]
[null,null,null,null,null,null,null,null,null,null,null,null,null,null,null,null,null,null,null,null,null,null,{"$f":"'Calcul - Berekening'!N31","v":""},{"$f":"'Calcul - Berekening'!N26","v":""}]
[null,null,null,null,null,null,null,null,"[n.c. =",{"$f":"Langage!A120","v":"Donnée non disponible]"},null,null,{"$f":"Langage!A123","v":"(dimensions)"}]
[null,null,{"$f":"Langage!A121","v":"Marque"},"Type","VN","Vutile,adm","ɳ utile,adm","Tmax,adm","p0,fabr","pmax",{"$f":"Langage!A122","v":"circulation forcée?"},"Qmax,adm",{"$f":"Langage!A124","v":"diamètre"},{"$f":"Langage!A125","v":"hauteur"},{"$f":"Langage!A126","v":"raccord"},{"$f":"Langage!A127","v":"brides"},{"$f":"Langage!A128","v":"poids"},{"$f":"Langage!A129","v":"position"},{"$f":"Langage!A130","v":"avec support mural fixe"},{"$f":"Langage!A131","v":"avec jambes"},{"$f":"Langage!A132","v":"membrane/vessie"},null,{"$f":"Langage!A134","v":"couleur"},{"$f":"Langage!A135","v":"référence fabricant"},{"$f":"Langage!A136","v":"type"}]
[null,null,null,null,"ℓ","ℓ","-","°C","bar","bar",null,"m³/h","mm","mm",null,null,"kg","vert./horiz.",null,null,"butyl/EPDM",{"$f":"Langage!A133","v":"interchangeable"}]
[{"$f":"AJ6","v":0},null,1,2,3,4,5,6,7,8,9,10,11,12,13,14,15,16,17,18,19,20,21,23,24]
[{"$f":"IF(ROW()-ROW(dbConsult)<=COUNTIF(dbListRef,RefCherchee),MATCH(RefCherchee,OFFSET(DataBase!$A$6,A6,0,ROWS(dbList)),0)+A6,0)","v":1},null,{"$f":"IF($A7,INDEX(dbList,$A7,C$6),\"\")","v":0}," ",0,0,0,0,0,0,0,0,{"$f":"IF($A7,INDEX(dbList,$A7,M$6),\"\")","v":0},0,0,0,0,0,0,0,0,0,{"$f":"IF($A7,INDEX(dbList,$A7,W$6+1),\"\")","v":0},0,{"$f":"IF($A7,INDEX(dbList,$A7,Y$6),\"_\")","v":"_"}]
[{"$f":"IF(ROW()-ROW(dbConsult)<=COUNTIF(dbListRef,RefCherchee),MATCH(RefCherchee,OFFSET(DataBase!$A$6,A7,0,ROWS(dbList)),0)+A7,0)","v":2},null,0,"NOT IN DATABASE",0,0,0,0,0,0,0,0,0,0,0,0,0,0,0,0,0,0,0,0,"_"]
[{"$f":"IF(ROW()-ROW(dbConsult)<=COUNTIF(dbListRef,RefCherchee),MATCH(RefCherchee,OFFSET(DataBase!$A$6,A8,0,ROWS(dbList)),0)+A8,0)","v":0},null,"","","","","","","","","","","","","","","","","","","","","","","_"]
[{"$f":"IF(ROW()-ROW(dbConsult)<=COUNTIF(dbListRef,RefCherchee),MATCH(RefCherchee,OFFSET(DataBase!$A$6,A9,0,ROWS(dbList)),0)+A9,0)","v":0},null,"","","","","","","","","","","","","","","","","","","","","","","_"]
[{"$f":"IF(ROW()-ROW(dbConsult)<=COUNTIF(dbListRef,RefCherchee),MATCH(RefCherchee,OFFSET(DataBase!$A$6,A10,0,ROWS(dbList)),0)+A10,0)","v":0},null,"","","","","","","","","","","","","","","","","","","","","","","_"]
[{"$f":"IF(ROW()-ROW(dbConsult)<=COUNTIF(dbListRef,RefCherchee),MATCH(RefCherchee,OFFSET(DataBase!$A$6,A11,0,ROWS(dbList)),0)+A11,0)","v":0},null,"","","","","","","","","","","","","","","","","","","","","","","_"]
[{"$f":"IF(ROW()-ROW(dbConsult)<=COUNTIF(dbListRef,RefCherchee),MATCH(RefCherchee,OFFSET(DataBase!$A$6,A12,0,ROWS(dbList)),0)+A12,0)","v":0},null,"","","","","","","","","","","","","","","","","","","","","","","_"]
[{"$f":"IF(ROW()-ROW(dbConsult)<=COUNTIF(dbListRef,RefCherchee),MATCH(RefCherchee,OFFSET(DataBase!$A$6,A13,0,ROWS(dbList)),0)+A13,0)","v":0},null,"","","","","","","","","","","","","","","","","","","","","","","_"]
[{"$f":"IF(ROW()-ROW(dbConsult)<=COUNTIF(dbListRef,RefCherchee),MATCH(RefCherchee,OFFSET(DataBase!$A$6,A14,0,ROWS(dbList)),0)+A14,0)","v":0},null,"","","","","","","","","","","","","","","","","","","","","","","_"]
{"$rows_left_out":319}
{"sheet":"Richtlijnen","index":3,"n_rows":328,"n_cols":17,"rows_kept":328,"cut":false,"hidden":false,"merged":[[84,0,85,0],[91,0,92,0],[286,12,286,16],[287,12,287,16],[171,0,172,0],[158,0,159,0],[152,0,153,0],[187,0,188,0],[221,0,222,0],[226,0,227,0],[192,0,193,0],[197,0,198,0],[202,0,203,0],[207,0,208,0],[213,0,214,0],[238,12,238,13],[286,1,286,3],[255,1,255,4],[24,0,25,0],[30,0,31,0],[176,0,177,0],[183,0,184,0],[164,0,165,0],[37,0,38,0],[41,0,42,0],[60,0,61,0],[112,0,113,0],[133,0,134,0],[143,0,144,0],[71,0,72,0],[146,0,147,0],[96,0,97,0],[102,0,103,0],[79,0,80,0],[2,12,2,16],[237,12,237,16],[57,3,57,5],[2,1,2,7],[10,4,10,5],[3,12,3,13],[237,1,237,6]]}
[]
[]
[null,"RICHTLIJNEN VOOR HET INVULLEN VAN HET REKENBLAD",null,null,null,null,null,null,null,null,null,"Link naar:","Werkingsprincipe expansievat met 3 situaties"]
[null,null,null,null,null,null,null,null,null,null,null,null,"Rekenvoorbeeld"]
[null,"Het gebruik van het rekenblad verloopt in 3 stappen:"]
[]
[null,"1. Invoer van de gegevens van de installatie"]
[null,"2. Berekening van tussenwaarden"]
[null,"3. Keuze van het expansievat en uitvoering van sommige controles om deze keuze te kunnen bevestigen"]
[]
[null,"In het rekenblad zijn enkel de ",null,null,"omlijnde velden",null," als invoergegevens door de gebruiker in te vullen;"]
[null,"alle andere velden zijn beschermd en worden automatisch berekend en ingevuld op basis van de formules die expliciet vermeld zijn."]
[]
[null,"Voor meer informatie betreffende de in dit rekenblad aanwezige parameters, kan individueel geklikt worden op elke parameter van het tabblad 'Calcul - Berekening'. "]
[null,"U wordt dan doorverwezen naar een beschrijving in dit tabblad 'Richtlijnen'."]
{"$rows_left_out":314}
{"sheet":"Directives","index":4,"n_rows":328,"n_cols":17,"rows_kept":328,"cut":false,"hidden":false,"merged":[[30,0,31,0],[2,12,2,17],[3,12,3,13],[10,4,10,5],[24,0,25,0],[2,1,2,8],[202,0,203,0],[143,0,144,0],[37,0,38,0],[41,0,42,0],[60,0,61,0],[71,0,72,0],[79,0,80,0],[84,0,85,0],[91,0,92,0],[96,0,97,0],[102,0,103,0],[112,0,113,0],[133,0,134,0],[238,12,238,13],[287,12,287,17],[237,1,237,7],[237,12,237,16],[286,12,286,16],[255,1,255,3],[57,3,57,5],[286,1,286,3],[213,0,214,0],[221,0,222,0],[226,0,227,0],[207,0,208,0],[146,0,147,0],[152,0,153,0],[158,0,159,0],[164,0,165,0],[171,0,172,0],[176,0,177,0],[183,0,184,0],[187,0,188,0],[192,0,193,0],[197,0,198,0]]}
[]
[]
[null,"DIRECTIVES POUR LE REMPLISSAGE DE LA FEUILLE DE CALCUL",null,null,null,null,null,null,null,null,null,"Lien vers :","Principe de fonctionnement d'un vase d'expansion (3 situations)"]
[null,null,null,null,null,null,null,null,null,null,null,null,"Exemple de calcul"]
[null,"L'utilisation de la feuille de calcul se déroule en 3 étapes :"]
[]
[null,"1. Introduction des données de l'installation"]
[null,"2. Calcul des valeurs intermédiaires"]
[null,"3. Choix du vase d'expansion et réalisation de certains contrôles destinés à confirmer ce choix"]
[]
[null,"Dans la feuille de calcul, seuls",null,null,"les champs encadrés",null," doivent être complétés par l'utilisateur;"]
[null,"tous les autres champs sont protégés et sont automatiquement calculés et complétés sur la base des formules qui sont explicitement mentionnées."]
[]
[null,"Vous pouvez cliquer sur chaque paramètre de la feuille de calcul 'Calcul - Berekening' pour obtenir davantage d'informations au sujet du paramètre en question."]
[null,"Vous serez alors redirigés vers l'onglet 'Directives' pour la description détaillée du paramètre."]
{"$rows_left_out":314}
{"sheet":"Langage","index":5,"n_rows":136,"n_cols":17,"rows_kept":136,"cut":false,"hidden":true,"merged":[]}
["Choix"]
[null,1,2]
[{"$f":"'Calcul - Berekening'!D2","v":"Français"},"Français","Nederlands",null,null,"FR","NL"]
[]
[{"$f":"IF(A$3=B$3,B5,C5)","v":"Feuille de calcul destinée au dimensionnement du volume d'un vase d'expansion sanitaire"},"Feuille de calcul destinée au dimensionnement du volume d'un vase d'expansion sanitaire","Rekenblad voor de bepaling van het volume van een sanitair expansievat"]
[{"$f":"IF(A$3=B$3,B6,C6)","v":"Références"},"Références","Referentie"]
[{"$f":"IF(A$3=B$3,B7,C7)","v":"Données relatives à l'installation"},"Données relatives à l'installation","Invoergegevens voor de installatie"]
[{"$f":"IF(A$3=B$3,B8,C8)","v":"Calculs"},"Calculs","Berekening"]
["Choix du vase d'expansion","Choix du vase d'expansion","Keuze van het expansievat"]
[0]
[{"$f":"IF(A$3=B$3,B11,C11)","v":"1 Contenance en eau du boiler"},"1 Contenance en eau du boiler","1 Waterinhoud van de boiler of het warmwatervoorraadvat",null,null,{"$f":"HYPERLINK(CELL(\"address\",Directives!B25))","v":"[Vase_d_expansion_sanitaire_Sanitair_expansievat_v1.1.FR.xlsm]Directives!$B$25"},{"$f":"HYPERLINK(CELL(\"address\",Richtlijnen!B25))","v":"[Vase_d_expansion_sanitaire_Sanitair_expansievat_v1.1.FR.xlsm]Richtlijnen!$B$25"}]
["2 Température de consigne pour l'eau chaude sanitaire","2 Température de consigne pour l'eau chaude sanitaire","2 Ontwerptemperatuur voor het sanitair warm water",null,null,{"$f":"HYPERLINK(CELL(\"address\",Directives!B31))","v":"[Vase_d_expansion_sanitaire_Sanitair_expansievat_v1.1.FR.xlsm]Directives!$B$31"},{"$f":"HYPERLINK(CELL(\"address\",Richtlijnen!B31))","v":"[Vase_d_expansion_sanitaire_Sanitair_expansievat_v1.1.FR.xlsm]Richtlijnen!$B$31"}]
[{"$f":"IF(A$3=B$3,B13,C13)","v":"3 Pression de tarage de la soupape de sûreté"},"3 Pression de tarage de la soupape de sûreté","3 Insteldruk van het veiligheidsventiel",null,null,{"$f":"HYPERLINK(CELL(\"address\",Directives!B38))","v":"[Vase_d_expansion_sanitaire_Sanitair_expansievat_v1.1.FR.xlsm]Directives!$B$38"},{"$f":"HYPERLINK(CELL(\"address\",Richtlijnen!B38))","v":"[Vase_d_expansion_sanitaire_Sanitair_expansievat_v1.1.FR.xlsm]Richtlijnen!$B$38"}]
[{"$f":"IF(A$3=B$3,B14,C14)","v":"4 Pression de l'eau dans l'installation au niveau du vase d'expansion"},"4 Pression de l'eau dans l'installation au niveau du vase d'expansion","4 Waterdruk in de installatie ter hoogte van het sanitair expansievat",null,null,{"$f":"HYPERLINK(CELL(\"address\",Directives!B42))","v":"[Vase_d_expansion_sanitaire_Sanitair_expansievat_v1.1.FR.xlsm]Directives!$B$42"},{"$f":"HYPERLINK(CELL(\"address\",Richtlijnen!B42))","v":"[Vase_d_expansion_sanitaire_Sanitair_expansievat_v1.1.FR.xlsm]Richtlijnen!$B$42"}]
[{"$f":"IF(A$3=B$3,B15,C15)","v":"5 Différence de hauteur (delta h) entre le vase d'expansion et la soupape de sûreté"},"5 Différence de hauteur (delta h) entre le vase d'expansion et la soupape de sûreté","5 Hoogteverschil (delta h) tussen expansievat en veiligheidsventiel",null,null,{"$f":"HYPERLINK(CELL(\"address\",Directives!B61))","v":"[Vase_d_expansion_sanitaire_Sanitair_expansievat_v1.1.FR.xlsm]Directives!$B$61"},{"$f":"HYPERLINK(CELL(\"address\",Richtlijnen!B61))","v":"[Vase_d_expansion_sanitaire_Sanitair_expansievat_v1.1.FR.xlsm]Richtlijnen!$B$61"}]
{"$rows_left_out":122}
{"sheet":"DataBase","index":6,"n_rows":333,"n_cols":36,"rows_kept":333,"cut":false,"hidden":true,"merged":[]}
[null,"calculs","VN,min","Tmax","psv",null,null,null,null,null,null,"Choix vase",null,"circulation",null,null,"vert/horiz",null,null,"membrane inter",null,"marque"]
[null,null,{"$f":"'Calcul - Berekening'!N31","v":""},{"$f":"'Calcul - Berekening'!N17","v":0},{"$f":"'Calcul - Berekening'!N18","v":0},null,null,null,null,null,null,null,null,{"$f":"'Calcul - Berekening'!E35","v":0},{"$f":"IF(OR($N$2=\"oui\",$N$2=\"ja\"),\"yes\",IF(OR($N$2=\"non\",$N$2=\"nee\"),\"no\",\"\"))","v":""},null,{"$f":"'Calcul - Berekening'!E36","v":0},{"$f":"IF(OR($Q$2=\"verticale\",$Q$2=\"verticaal\"),\"vertical\",IF(OR($Q$2=\"horizontale\",$Q$2=\"horizontaal\"),\"horizontal\",\"\"))","v":""},null,{"$f":"'Calcul - Berekening'!E37","v":0},{"$f":"IF(OR($T$2=\"oui\",$T$2=\"ja\"),\"yes\",IF(OR($T$2=\"non\",$T$2=\"nee\"),\"no\",\"\"))","v":""},{"$f":"'Calcul - Berekening'!E38","v":0},{"$f":"IF(V2=\"Flamco\",\"Flamco\",IF(V2=\"Pneumatex\",\"Pneumatex\",IF(V2=\"Reflex\",\"Reflex\",IF(V2=\"Watts\",\"Watts\",IF(V2=0,\"\",V2)))))","v":""}]
[null,null,null,null,null,null,null,null,"Dimensions"]
[null,"Marque","Type","capacité","volume utile max","rendement max","Tmax admissible","p0 standard","pression de service max","circulation forcée","débit max","diamètre","H","raccord","brides","poids","position","avec support mural fixe","avec jambes","membrane","membrane interchangeable","remplissage","couleur","référence fabricant","famille",null,null,"VN >= VN,min","Tmax,fabr >= Tmax,réelle","pmax,fabr > psv * 1,2","circulation forcée","choix","vert/horiz","membrane inter","marque","score"]
[null,null,null,"l","l","-","°C","bar","bar",null,"m³/h","mm","mm",null,null,"kg","vert./horiz.",null,"oui/non","butyl/EPDM"]
[{"$f":"AJ6","v":1},null," ",null,null,null,null,null,null,null,null,null,null,null,null,null,null,null,null,null,null,null,null,null,"_",null,null,null,null,null,null,null,null,null,null,1]
[{"$f":"AJ7","v":1},null,"NOT IN DATABASE",null,null,null,null,null,null,null,null,null,null,null,null,null,null,null,null,null,null,null,null,null,"_",null,null,null,null,null,null,null,null,null,null,1]
[{"$f":"AJ8","v":0},"Flamco","Airfix D 8",8,{"$f":"ROUNDDOWN(F8*D8,1)","v":5},0.63,70,4,10,"full flow","n.c.",245,301,"R 3/4\"","-",3.2,"vertical","no","no","butyl","no","azote/stikstof","blanc/wit",14259,"Airfix D 8 - 35",null,null,{"$f":"IF(AND($C$2>0,$C$2<=D8),1,0)","v":0},{"$f":"IF(G8>=$D$2>0,1,0)","v":1},{"$f":"IF(I8>=$E$2*1.2>0,1,0)","v":1},{"$f":"IF(J8=\"no\",\"no\",\"yes\")","v":"yes"},{"$f":"IF(OR(($O$2=AE8),($O$2=\"\")),1,0)","v":1},{"$f":"IF(OR(($R$2=Q8),($R$2=\"\")),1,0)","v":1},{"$f":"IF(OR(($U$2=U8),($U$2=\"\")),1,0)","v":1},{"$f":"IF(OR(($W$2=B8),($W$2=\"\")),1,0)","v":1},{"$f":"AB8*AC8*AD8*AF8*AG8*AH8*AI8","v":0}]
[{"$f":"AJ9","v":0},"Flamco","Airfix D 12",12,{"$f":"ROUNDDOWN(F9*D9,1)","v":7.5},0.63,70,4,10,"full flow","n.c.",286,334,"R 3/4\"","-",4.3,"vertical","no","no","butyl","no","azote/stikstof","blanc/wit",14349,"Airfix D 8 - 35",null,null,{"$f":"IF(AND($C$2>D8,$C$2<=D9),1,0)","v":0},{"$f":"IF(G9>=$D$2>0,1,0)","v":1},{"$f":"IF(I9>=$E$2*1.2>0,1,0)","v":1},{"$f":"IF(J9=\"no\",\"no\",\"yes\")","v":"yes"},{"$f":"IF(OR(($O$2=AE9),($O$2=\"\")),1,0)","v":1},{"$f":"IF(OR(($R$2=Q9),($R$2=\"\")),1,0)","v":1},{"$f":"IF(OR(($U$2=U9),($U$2=\"\")),1,0)","v":1},{"$f":"IF(OR(($W$2=B9),($W$2=\"\")),1,0)","v":1},{"$f":"AB9*AC9*AD9*AF9*AG9*AH9*AI9","v":0}]
[0,"Flamco","Airfix D 18",18,{"$f":"ROUNDDOWN(F10*D10,1)","v":11.3},0.63,70,4,10,"full flow","n.c.",328,325,"R 3/4\"","-",4.9000000000000004,"vertical","no","no","butyl","no","azote/stikstof","blanc/wit",14459,"Airfix D 8 - 35",null,null,{"$f":"IF(AND($C$2>D9,$C$2<=D10),1,0)","v":0},1,1,"yes",1,1,1,1,0]
[0,"Flamco","Airfix D 25",25,15.7,0.63,70,4,10,"full flow","n.c.",358,378,"R 3/4\"","-",6.6,"vertical","no","no","butyl","no","azote/stikstof","blanc/wit",14559,"Airfix D 8 - 35",null,null,{"$f":"IF(AND($C$2>D10,$C$2<=D11),1,0)","v":0},1,1,"yes",1,1,1,1,0]
[0,"Flamco","Airfix D 35",35,22,0.63,70,4,8,"full flow","n.c.",396,437,"R 3/4\"","-",8.1,"vertical","no","no","butyl","no","azote/stikstof","blanc/wit",14659,"Airfix D 8 - 35",null,null,{"$f":"IF(AND($C$2>D11,$C$2<=D12),1,0)","v":0},1,1,"yes",1,1,1,1,0]
[0,"Flamco","Airfix A 8",8,5,0.63,70,4,10,"partial flow","/",245,301,"R 3/4\"","-",3.2,"vertical","no","no","butyl","no","azote/stikstof","blanc/wit",24259,"Airfix A 8 - 80",null,null,{"$f":"IF(AND($C$2>0,$C$2<=D13),1,0)","v":0},1,1,"yes",1,1,1,1,0]
[0,"Flamco","Airfix A 12",12,7.5,0.63,70,3,10,"partial flow","/",286,334,"R 3/4\"","-",4.3,"vertical","no","no","butyl","no","azote/stikstof","blanc/wit",24348,"Airfix A 8 - 80",null,null,{"$f":"IF(AND($C$2>D13,$C$2<=D14),1,0)","v":0},1,1,"yes",1,1,1,1,0]
[0,"Flamco","Airfix A 12",12,7.5,0.63,70,4,10,"partial flow","/",286,334,"R 3/4\"","-",4.3,"vertical","no","no","butyl","no","azote/stikstof","blanc/wit",24349,"Airfix A 8 - 80",null,null,0,1,1,"yes",1,1,1,1,0]
{"$rows_left_out":319}
{"sheet":"Coef_expansion","index":7,"n_rows":20,"n_cols":10,"rows_kept":20,"cut":false,"hidden":true,"merged":[[2,1,2,6],[18,0,18,6]]}
[]
[]
["Température maximale de service","Coefficient d'expansion e (en %)",null,null,null,null,null,"Volume massique\neau pure\n","Pression de vapeur saturante\neau pure","Débit de contraction"]
["°C",0,null,null,null,null,null,"dm³/kg","bar","l.h/kW"]
[10,0,null,null,null,null,null,1.0003,0]
[20,0.14000000000000001,null,null,null,null,null,1.0017,0]
[30,0.4,null,null,null,null,null,1.0043,0]
[40,0.75,null,null,null,null,null,1.0078,0]
[50,1.18,null,null,null,null,null,1.0121,0,0.39]
[60,1.68,null,null,null,null,null,1.0170999999999999,0,0.45]
[70,2.25,null,null,null,null,null,1.0227999999999999,0,0.51]
[80,2.89,null,null,null,null,null,1.0291999999999999,0,0.56999999999999995]
[90,3.57,null,null,null,null,null,1.0361,0,0.63]
[100,4.34,null,null,null,null,null,1.0437000000000001,0.01,0.69]
[110,5.15,null,null,null,null,null,1.0519000000000001,0.43]
{"$rows_left_out":6}
{"sheet":"Images","index":8,"n_rows":32,"n_cols":1,"rows_kept":32,"cut":false,"hidden":true,"merged":[]}
["Famille"]
[]
["_"]
["Airfix D 8 - 35"]
["Airfix A 8 - 80"]
["Airfix D-E 100 - 3000"]
["Airfix D-E 50 - 3000"]
["Airfix P 2 - 300"]
["Airfix P 400 - 5000"]
["Airfix P 24-H - 300-H"]
["Airfix D-E-B 1600 - 3000"]
["Airfix D-E-B 50 - 3000"]
["Aquapresso AD 8 - 80"]
["Aquapresso ADF 8 - 80"]
["Aquapresso AU 140 - 600"]
{"$rows_left_out":17}